{"text_format":"1","workbook":"xlsx","n_sheets":10,"sheets":["Opslagsværk","Info om kontoplansdim. - Print","Tværgående Dimension - Print","Drift tværgående - Print","Anlæg tværgående - Print","Opdatering af opslagsværk","Formål_1","Formål_2","Formål_3","Beskrivelser (DHY)"],"not_rendered":{"charts":0,"images":7,"macros":1,"external_links":0,"defined_names":47,"comments":0,"pivot_tables":0},"unopened":[],"bounds":{"document_bytes":16777216,"sheet_cells":100000,"rows_first":2000,"rows_last":500,"rows_between":2000,"halvings":0,"cell_chars":16384,"cell_head_chars":4096},"cells_cut":0,"cells_raw":0,"read":"whole","date_system":"1900"}

{"sheet":"Opslagsværk","index":0,"n_rows":20,"n_cols":27,"rows_kept":20,"cut":false,"hidden":false,"merged":[[2,4,2,9],[6,4,6,9],[14,4,14,9],[19,4,19,9],[4,4,4,9],[8,4,9,9],[10,1,10,2],[15,1,19,1],[15,2,19,2],[15,4,15,6],[15,7,15,9],[16,4,16,6],[16,7,16,9],[17,4,17,6],[17,7,17,9],[18,4,18,6],[18,7,18,9],[10,8,10,9]]}
[]
[null,"OPSLAGSVÆRK TVÆRGÅENDE DIMENSION"]
[null,"\nBrug knappen til at nulstille felterne i tværgående dimension\n↓↓↓","\nStil dig i felterne herunder og brug knappen til at vælge de tværgående dimensioner",null,"\nForklarende tekst \ntil niveauerne i den tværgående dimension",null,null,null,null,null,null,null,null,null,null,null,null,null,null,null,null,null,null,null,null,null,"Tjek"]
[]
[null,"Vælg dimensionsniveau 1:",null,null,{"$f":"IFERROR(VLOOKUP(C5,'Beskrivelser (DHY)'!B:C,2,FALSE),\"\")","v":""},null,null,null,null,null,null,null," "]
[]
[null,"Vælg dimensionsniveau 2:",null,null,{"$f":"IFERROR(VLOOKUP(C7,'Beskrivelser (DHY)'!F:G,2,FALSE),\"\")","v":""},null,null,null,null,null,null,null,null,null,null,null,null,null,null,null,null,null,null,null,null,null,{"$f":"IF(INDEX(Formål_1!A:A,MATCH(Opslagsværk!C7,Formål_1!B:B,0))=C5,\"OK\",\"IKKE OK\")","v":{"$error":"#N/A"}}]
[]
[null,"Vælg dimensionsniveau 3:",null,null,{"$f":"IFERROR(VLOOKUP(C9,'Beskrivelser (DHY)'!J:K,2,FALSE),\"\")","v":""},null,null,null,null,null,null,null,null,null,null,null,null,null,null,null,null,null,null,null,null,null,{"$f":"IF(AA7=\"IKKE OK\",\"IKKE OK\",IF(INDEX(Formål_2!A:A,MATCH(Opslagsværk!C9,Formål_2!B:B,0))=C7,\"OK\",\"IKKE OK\"))","v":{"$error":"#N/A"}}]
[null,"Kombination af ovenstående",{"$f":"IF(OR(C5=\"\",C7=\"\",C9=\"\"),\"\",LEFT(C5,2)&LEFT(C7,2)&LEFT(C9,999))","v":""},null,null,null,null,null,null,null,null,null,null,null,null,null,null,null,null,null,null,null,null,null,null,null,{"$f":"IF(AA7=\"IKKE OK\",\"IKKE OK\",IF(AA9=\"IKKE OK\",\"IKKE OK\",\"OK\"))","v":{"$error":"#N/A"}}]
{"$rows_left_out":11}
{"sheet":"Info om kontoplansdim. - Print","index":1,"n_rows":0,"n_cols":0,"rows_kept":0,"cut":false,"hidden":false,"merged":[]}

{"sheet":"Tværgående Dimension - Print","index":2,"n_rows":137,"n_cols":5,"rows_kept":137,"cut":false,"hidden":false,"merged":[]}
["Dimensions-niveau 1","Tværgående dimension","Tværgående dimension forklaringstekst"]
[{"$f":"IFERROR(VLOOKUP(VALUE(LEFT(B2,2)),'Beskrivelser (DHY)'!A:B,2,FALSE),\"\")","v":"20: Overførselsudgifter"},{"$f":"IF('Beskrivelser (DHY)'!N2=\"\",\"\",'Beskrivelser (DHY)'!N2)","v":"2020200: Overførs.udg.-Forsørgelse - Forsørgelse"},{"$f":"IF('Beskrivelser (DHY)'!K2=\"\",\"\",'Beskrivelser (DHY)'!K2)","v":"Udgifter til forsørgelsesydelser konteres her. Det kan f.eks være kontant- og uddannelseshjælp, integrationsydelse, ledighedsydelse, sygedagpenge, ressourceforløbsydelse, revalideringsydelse, fleksløntilskud og EGU (skoleydelse/løn). "}]
[{"$f":"IFERROR(VLOOKUP(VALUE(LEFT(B3,2)),'Beskrivelser (DHY)'!A:B,2,FALSE),\"\")","v":"20: Overførselsudgifter"},{"$f":"IF('Beskrivelser (DHY)'!N3=\"\",\"\",'Beskrivelser (DHY)'!N3)","v":"2020202: Overførs.udg.-Forsørgelse - Løntilskud"},{"$f":"IF('Beskrivelser (DHY)'!K3=\"\",\"\",'Beskrivelser (DHY)'!K3)","v":"Udgifter til alle former for løntilskud uanset målgruppe konteres på dimensionsværdi 2020202. Det kan bl.a. være udgifter til løntilskud til fleksjob/skånejob, revalidender, forsikrede ledige (privat/offentligt), voksenlærlinge, integrationsydelsesmodtagere, kontant- og uddannelseshjælpsmodtagere, og ressourceforløbsydelsesmodtagere."}]
[{"$f":"IFERROR(VLOOKUP(VALUE(LEFT(B4,2)),'Beskrivelser (DHY)'!A:B,2,FALSE),\"\")","v":"20: Overførselsudgifter"},{"$f":"IF('Beskrivelser (DHY)'!N4=\"\",\"\",'Beskrivelser (DHY)'!N4)","v":"2020204: Overførs.udg.-Forsørgelse - Medfinansiering"},{"$f":"IF('Beskrivelser (DHY)'!K4=\"\",\"\",'Beskrivelser (DHY)'!K4)","v":"Udgifter til medfinansiering af forsørgelse konteres her. Der vil være tale om medfinansiering af a-dagpenge og førtidspensioner. Medfinansiering af boligstøtte, varmetillæg og særlig støtte §34 konteres under dimension 2024240, da der ikke er tale om forsørgelsesudgifter."}]
[{"$f":"IFERROR(VLOOKUP(VALUE(LEFT(B5,2)),'Beskrivelser (DHY)'!A:B,2,FALSE),\"\")","v":"20: Overførselsudgifter"},{"$f":"IF('Beskrivelser (DHY)'!N5=\"\",\"\",'Beskrivelser (DHY)'!N5)","v":"2022220: Overførs.udg.-Indsatser"},{"$f":"IF('Beskrivelser (DHY)'!K5=\"\",\"\",'Beskrivelser (DHY)'!K5)","v":"Udgifter til indsatser omfatter køb af indsatser/aktivering over for alle målgrupper. Det kan f.eks være mentor, danskuddannelse, forskellige statslige puljer (regional uddannelsespulje, pulje til uddannelsesløft), jobrotation, vejledning- og opkvalificeringstilbud, godtgørelse §83, den koordinerede ungeindsats (KUI) og indsatser vedr. EGU."}]
[{"$f":"IFERROR(VLOOKUP(VALUE(LEFT(B6,2)),'Beskrivelser (DHY)'!A:B,2,FALSE),\"\")","v":"20: Overførselsudgifter"},{"$f":"IF('Beskrivelser (DHY)'!N6=\"\",\"\",'Beskrivelser (DHY)'!N6)","v":"2024240: Overførs.udg.-Øvrige"},{"$f":"IF('Beskrivelser (DHY)'!K6=\"\",\"\",'Beskrivelser (DHY)'!K6)","v":"Her konteres som udgangspunkt alle øvrige udgifter/indtægter, som ikke kan henføres til en af de øvrige tværgående dimensioner på overførselsudgifterne. Det kan f.eks. være hjælpemidler, befordringsgodtgørelse, personlig assistance, mellemkommunale betalinger, grundtilskud, resultattilskud, enkeltydelser, støtte til repatriering, særlig støtte § 34, tabt arbejdsfortjeneste, merudgifter til voksne/børn, boligstøtte, personlige tillæg og hjemmetræning."}]
[{"$f":"IFERROR(VLOOKUP(VALUE(LEFT(B7,2)),'Beskrivelser (DHY)'!A:B,2,FALSE),\"\")","v":"30: Puljer mv."},{"$f":"IF('Beskrivelser (DHY)'!N7=\"\",\"\",'Beskrivelser (DHY)'!N7)","v":"3030300: Pulje mv. - Overført over-/underskud"},{"$f":"IF('Beskrivelser (DHY)'!K7=\"\",\"\",'Beskrivelser (DHY)'!K7)","v":"Her må ikke bogføres. Anvendes kun til registrering af overførte mere- eller mindre forbrug mellem årene. "}]
[{"$f":"IFERROR(VLOOKUP(VALUE(LEFT(B8,2)),'Beskrivelser (DHY)'!A:B,2,FALSE),\"\")","v":"30: Puljer mv."},{"$f":"IF('Beskrivelser (DHY)'!N8=\"\",\"\",'Beskrivelser (DHY)'!N8)","v":"3030310: Pulje mv. - Reduktion/omstilling"},{"$f":"IF('Beskrivelser (DHY)'!K8=\"\",\"\",'Beskrivelser (DHY)'!K8)","v":"Her må ikke bogføres. Anvendes kun til registrering af budgetpuljer til senere udmøntning."}]
[{"$f":"IFERROR(VLOOKUP(VALUE(LEFT(B9,2)),'Beskrivelser (DHY)'!A:B,2,FALSE),\"\")","v":"30: Puljer mv."},{"$f":"IF('Beskrivelser (DHY)'!N9=\"\",\"\",'Beskrivelser (DHY)'!N9)","v":"3030320: Pulje mv. - Politisk til prioritering"},{"$f":"IF('Beskrivelser (DHY)'!K9=\"\",\"\",'Beskrivelser (DHY)'!K9)","v":"Her må ikke bogføres. Anvendes kun til registrering af budgetpuljer til senere politisk prioritering."}]
[{"$f":"IFERROR(VLOOKUP(VALUE(LEFT(B10,2)),'Beskrivelser (DHY)'!A:B,2,FALSE),\"\")","v":"30: Puljer mv."},{"$f":"IF('Beskrivelser (DHY)'!N10=\"\",\"\",'Beskrivelser (DHY)'!N10)","v":"3032320: Pulje mv. - Flexjob"},{"$f":"IF('Beskrivelser (DHY)'!K10=\"\",\"\",'Beskrivelser (DHY)'!K10)","v":"Her må ikke bogføres. Anvendes kun til registrering af budgetpuljer til senere politisk prioritering."}]
{"$rows_left_out":128}
{"sheet":"Drift tværgående - Print","index":3,"n_rows":177,"n_cols":10,"rows_kept":177,"cut":false,"hidden":false,"merged":[[0,7,0,8]]}
["Dimensions-niveau 1",null,"Dimensions-niveau 2",null,"Dimensions-niveau 3","Tværgående dimension forklaringstekst",null,"SÅDAN VISES TVÆRGÅENDE DIMENSION I PRISME"]
[]
["0x","Anlægsprojekter (se særskilt fane)",null,null,null,null,null,null,"Angiver på hvilke tværgående dimensioner SD løn fordeler udbetalt løn i økonomi."]
[null,null,null,null,null,null,null,null,"Dimension 4040490 anvendes KUN sammen med dimension 4040492, og benyttes, når der skal manuelt omkonteres løn f.eks. ifm. udlån af medarbejdere. I den forbindelse skal der også anvendes IM-art 1.2"]
["1x","Finansiering (dranst 4-7, se særskilt fane)"]
[20,"Overførselsudgifter"]
[null,null,20,"Forsørgelse"]
[null,null,null,null,200,"Forsørgelse",null,"2020200","Overførs.udg.-Forsørgelse - Forsørgelse"]
[null,null,null,null,202,"Løntilskud",null,"2020202","Overførs.udg.-Forsørgelse - Løntilskud"]
[null,null,null,null,204,"Medfinansiering (forsørgelse)",null,"2020204","Overførs.udg.-Forsørgelse - Medfinansiering"]
{"$rows_left_out":168}
{"sheet":"Anlæg tværgående - Print","index":4,"n_rows":336,"n_cols":10,"rows_kept":336,"cut":false,"hidden":false,"merged":[[0,7,0,8]]}
["Dimensions-niveau 1",null,"Dimensions-niveau 2",null,"Dimensions-niveau 3","Tværgående dimension forklaringstekst",null,"SÅDAN VISES TVÆRGÅENDE DIMENSION I PRISME"]
[]
["01","Ejendomme"]
[null,0,"Rådighedsbeløb"]
[null,null,0,"Rådighedsbeløb"]
[null,null,null,null,888,"Frigivet rådighedsbeløb",null,"0100888","Frigivet rådighedsbeløb"]
[null,null,null,null,"999","Ikke frigivet rådighedsbeløb",null,"0100999","Ikke frigivet rådighedsbeløb"]
[null,"1","Grund"]
[null,null,"0","Rådighedsbeløb"]
[null,null,null,null,"888","Frigivet rådighedsbeløb",null,"0110888","Gr-Forund-Frigivet rådighedsbeløb"]
{"$rows_left_out":327}
{"sheet":"Opdatering af opslagsværk","index":5,"n_rows":6,"n_cols":2,"rows_kept":6,"cut":false,"hidden":false,"merged":[[0,0,1,1]]}
["Opdateringer\nHerunder fremgår seneste ændringer af opslagsværket. "]
[]
["Dato","Beskrivelse"]
["2023-04-19","Diverse korrekturrettelser i teksten"]
["2023-03-02","Ny tværgående dimension under personaleudgifter: 4446480 Personaleudgifter - Pers.relateret udlæg"]
["2022-10-25","Ny tværgående dimension under anlæg: 0113004 - Gr-Klarg-Genhusning"]

{"sheet":"Formål_1","index":6,"n_rows":27,"n_cols":4,"rows_kept":27,"cut":false,"hidden":true,"merged":[]}
["Formål 1","Formål 2",null,"Formål 1"]
["20: Overførselsudgifter","20: Forsørgelse",null,"20: Overførselsudgifter"]
["20: Overførselsudgifter","22: Indsatser",null,"30: Puljer mv."]
["20: Overførselsudgifter","24: Øvrige",null,"40: Løn"]
["30: Puljer mv.","30: Overførte beløb/reduktion/omstilling",null,"44: Personaleudgifter"]
["30: Puljer mv.","32: Puljer til senere udmøntning",null,"48: Pensionerede tjenestemænd"]
["40: Løn","40: Lønninger",null,"50: Materiale- og aktivitetsudgifter"]
["40: Løn","42: Lønrefusioner",null,"60: Kapacitetsudgifter"]
["44: Personaleudgifter","44: Uddannelse",null,"70: Grunde og bygninger"]
["44: Personaleudgifter","46: Øvrige personaleudgifter",null,"80: Betaling andre offentlige myndigheder"]
{"$rows_left_out":18}
{"sheet":"Formål_2","index":7,"n_rows":136,"n_cols":11,"rows_kept":136,"cut":false,"hidden":true,"merged":[]}
["Formål 2","Formål 3",null,"Formål 2"]
["20: Forsørgelse","200: Overførs.udg.-Forsørgelse - Forsørgelse",null,"20: Forsørgelse",null,null,null,null,null,null,{"$f":"LEFT(I2,3)&MID(M2,8,999)","v":""}]
["20: Forsørgelse","202: Overførs.udg.-Forsørgelse - Løntilskud",null,"22: Indsatser"]
["20: Forsørgelse","204: Overførs.udg.-Forsørgelse - Medfinansiering",null,"24: Øvrige"]
["22: Indsatser","220: Overførs.udg.-Indsatser",null,"30: Overførte beløb/reduktion/omstilling"]
["24: Øvrige","240: Overførs.udg.-Øvrige",null,"32: Puljer til senere udmøntning"]
["30: Overførte beløb/reduktion/omstilling","300: Pulje mv. - Overført over-/underskud",null,"40: Lønninger"]
["30: Overførte beløb/reduktion/omstilling","310: Pulje mv. - Reduktion/omstilling",null,"42: Lønrefusioner"]
["30: Overførte beløb/reduktion/omstilling","320: Pulje mv. - Politisk til prioritering",null,"44: Uddannelse"]
["32: Puljer til senere udmøntning","320: Pulje mv. - Flexjob",null,"46: Øvrige personaleudgifter"]
{"$rows_left_out":127}
{"sheet":"Formål_3","index":8,"n_rows":136,"n_cols":4,"rows_kept":136,"cut":false,"hidden":true,"merged":[]}
["Formål 3","Tværgående Dimension",null,"Formål 3"]
["200: Overførs.udg.-Forsørgelse - Forsørgelse","2020200: Overførs.udg.-Forsørgelse - Forsørgelse",null,"200: Overførs.udg.-Forsørgelse - Forsørgelse"]
["202: Overførs.udg.-Forsørgelse - Løntilskud","2020202: Overførs.udg.-Forsørgelse - Løntilskud",null,"202: Overførs.udg.-Forsørgelse - Løntilskud"]
["204: Overførs.udg.-Forsørgelse - Medfinansiering","2020204: Overførs.udg.-Forsørgelse - Medfinansiering",null,"204: Overførs.udg.-Forsørgelse - Medfinansiering"]
["220: Overførs.udg.-Indsatser","2022220: Overførs.udg.-Indsatser",null,"220: Overførs.udg.-Indsatser"]
["240: Overførs.udg.-Øvrige","2024240: Overførs.udg.-Øvrige",null,"240: Overførs.udg.-Øvrige"]
["300: Pulje mv. - Overført over-/underskud","3030300: Pulje mv. - Overført over-/underskud",null,"300: Pulje mv. - Overført over-/underskud"]
["310: Pulje mv. - Reduktion/omstilling","3030310: Pulje mv. - Reduktion/omstilling",null,"310: Pulje mv. - Reduktion/omstilling"]
["320: Pulje mv. - Flexjob","3032320: Pulje mv. - Flexjob",null,"320: Pulje mv. - Politisk til prioritering"]
["320: Pulje mv. - Politisk til prioritering","3030320: Pulje mv. - Politisk til prioritering",null,"320: Pulje mv. - Flexjob"]
{"$rows_left_out":127}
{"sheet":"Beskrivelser (DHY)","index":9,"n_rows":151,"n_cols":15,"rows_kept":151,"cut":false,"hidden":true,"merged":[]}
["Formål 1 nummer","Formål 1","Formål 1 forklaringstekst",null,"Formål 2 tal","Formål 2","Formål 2 forklaringstekst",null,"Formål 3 tal","Formål 3","Formål 3 forklaringstekst",null,"Tværgående dimension tal","Tværgående dimension","Kopi af kolonne K til formel"]
[{"$f":"IFERROR(VALUE(LEFT(B2,2)),LEFT(B2,2))","v":20},"20: Overførselsudgifter","Område 20 anvendes udelukkende til udgifter og indtægter, som vedrører kommunens overførselsudgifter. Området anvendes ikke på kommunens institutioner.",null,{"$f":"IFERROR(VALUE(LEFT(F2,2)),\"\")","v":20},"20: Forsørgelse","Område 2020 anvendes til kontering af udgifter/indtægter vedr. borgernes forsørgelse, som er defineret som direkte forsørgelsesudgifter, løntilskud og medfinansiering af forsørgelsesudgifter",null,{"$f":"IFERROR(VALUE(LEFT(J2,3)),\"\")","v":200},"200: Overførs.udg.-Forsørgelse - Forsørgelse","Udgifter til forsørgelsesydelser konteres her. Det kan f.eks være kontant- og uddannelseshjælp, integrationsydelse, ledighedsydelse, sygedagpenge, ressourceforløbsydelse, revalideringsydelse, fleksløntilskud og EGU (skoleydelse/løn). ",null,{"$f":"IFERROR(VALUE(LEFT(N2,7)),\"\")","v":2020200},"2020200: Overførs.udg.-Forsørgelse - Forsørgelse",{"$f":"K2","v":"Udgifter til forsørgelsesydelser konteres her. Det kan f.eks være kontant- og uddannelseshjælp, integrationsydelse, ledighedsydelse, sygedagpenge, ressourceforløbsydelse, revalideringsydelse, fleksløntilskud og EGU (skoleydelse/løn). "}]
[30,"30: Puljer mv.","Området anvendes kun til budgettering af midler, der senere skal fordeles. ",null,{"$f":"IFERROR(VALUE(LEFT(F3,2)),\"\")","v":22},"22: Indsatser","Område 2022 anvendes til kontering af udgifter/indtægter vedr. indsatser til borgerne (køb af aktivering, tilbud, mentor m.v.)",null,{"$f":"IFERROR(VALUE(LEFT(J3,3)),\"\")","v":202},"202: Overførs.udg.-Forsørgelse - Løntilskud","Udgifter til alle former for løntilskud uanset målgruppe konteres på dimensionsværdi 2020202. Det kan bl.a. være udgifter til løntilskud til fleksjob/skånejob, revalidender, forsikrede ledige (privat/offentligt), voksenlærlinge, integrationsydelsesmodtagere, kontant- og uddannelseshjælpsmodtagere, og ressourceforløbsydelsesmodtagere.",null,{"$f":"IFERROR(VALUE(LEFT(N3,7)),\"\")","v":2020202},"2020202: Overførs.udg.-Forsørgelse - Løntilskud",{"$f":"K3","v":"Udgifter til alle former for løntilskud uanset målgruppe konteres på dimensionsværdi 2020202. Det kan bl.a. være udgifter til løntilskud til fleksjob/skånejob, revalidender, forsikrede ledige (privat/offentligt), voksenlærlinge, integrationsydelsesmodtagere, kontant- og uddannelseshjælpsmodtagere, og ressourceforløbsydelsesmodtagere."}]
[40,"40: Løn","Her konteres løn og lønrefusioner, der relaterer sig til personalet. ",null,24,"24: Øvrige","Område 2024 anvendes til kontering af udgifter/indtægter, som ikke kan henføres til område 2020 og 2022 .",null,204,"204: Overførs.udg.-Forsørgelse - Medfinansiering","Udgifter til medfinansiering af forsørgelse konteres her. Der vil være tale om medfinansiering af a-dagpenge og førtidspensioner. Medfinansiering af boligstøtte, varmetillæg og særlig støtte §34 konteres under dimension 2024240, da der ikke er tale om forsørgelsesudgifter.",null,2020204,"2020204: Overførs.udg.-Forsørgelse - Medfinansiering","Udgifter til medfinansiering af forsørgelse konteres her. Der vil være tale om medfinansiering af a-dagpenge og førtidspensioner. Medfinansiering af boligstøtte, varmetillæg og særlig støtte §34 konteres under dimension 2024240, da der ikke er tale om forsørgelsesudgifter."]
[44,"44: Personaleudgifter","Her konteres udgifter, bortset fra løn, der relaterer sig til personalet. ",null,30,"30: Overførte beløb/reduktion/omstilling","Område 3030 anvendes til budgettering af overførsler reduktioner samt til politiske puljer til senere prioritering. Der bogføres ikke under område 3030.",null,220,"220: Overførs.udg.-Indsatser","Udgifter til indsatser omfatter køb af indsatser/aktivering over for alle målgrupper. Det kan f.eks være mentor, danskuddannelse, forskellige statslige puljer (regional uddannelsespulje, pulje til uddannelsesløft), jobrotation, vejledning- og opkvalificeringstilbud, godtgørelse §83, den koordinerede ungeindsats (KUI) og indsatser vedr. EGU.",null,2022220,"2022220: Overførs.udg.-Indsatser","Udgifter til indsatser omfatter køb af indsatser/aktivering over for alle målgrupper. Det kan f.eks være mentor, danskuddannelse, forskellige statslige puljer (regional uddannelsespulje, pulje til uddannelsesløft), jobrotation, vejledning- og opkvalificeringstilbud, godtgørelse §83, den koordinerede ungeindsats (KUI) og indsatser vedr. EGU."]
[48,"48: Pensionerede tjenestemænd","Udgifter vedr. pensionerede tjenestemænd (centralt placeret udgift) konteres her.",null,32,"32: Puljer til senere udmøntning","Område 3032 anvendes til budgettering af puljer til senere udmøntning - f.eks. Reduktionspuljer/ ikke udmøntede besparelser. Der bogføres ikke under område 3032.",null,240,"240: Overførs.udg.-Øvrige","Her konteres som udgangspunkt alle øvrige udgifter/indtægter, som ikke kan henføres til en af de øvrige tværgående dimensioner på overførselsudgifterne. Det kan f.eks. være hjælpemidler, befordringsgodtgørelse, personlig assistance, mellemkommunale betalinger, grundtilskud, resultattilskud, enkeltydelser, støtte til repatriering, særlig støtte § 34, tabt arbejdsfortjeneste, merudgifter til voksne/børn, boligstøtte, personlige tillæg og hjemmetræning.",null,2024240,"2024240: Overførs.udg.-Øvrige","Her konteres som udgangspunkt alle øvrige udgifter/indtægter, som ikke kan henføres til en af de øvrige tværgående dimensioner på overførselsudgifterne. Det kan f.eks. være hjælpemidler, befordringsgodtgørelse, personlig assistance, mellemkommunale betalinger, grundtilskud, resultattilskud, enkeltydelser, støtte til repatriering, særlig støtte § 34, tabt arbejdsfortjeneste, merudgifter til voksne/børn, boligstøtte, personlige tillæg og hjemmetræning."]
[50,"50: Materiale- og aktivitetsudgifter","Udgifter vedr. kerneydelser  konteres alle udgifter, der direkte relaterer sig til kerneopgaven (undervisning, pasning af ældre osv.) undtaget løn- og personaleudgifter, der registreres under område 4. ",null,40,"40: Lønninger","Område 4040 omfatter lønudgifter inkl. pensionsforsikringspræmier og feriepenge. Derudover omfatter området lønninger der overføres mellem forskellige afdelinger. ",null,300,"300: Pulje mv. - Overført over-/underskud","Her må ikke bogføres. Anvendes kun til registrering af overførte mere- eller mindre forbrug mellem årene. ",null,3030300,"3030300: Pulje mv. - Overført over-/underskud","Her må ikke bogføres. Anvendes kun til registrering af overførte mere- eller mindre forbrug mellem årene. "]
[60,"60: Kapacitetsudgifter","Under område 60 Kapacitetsudgifter  konteres alle udgifter, der vedrører det udstyr, som anvendes for at Aabenraa Kommune kan levere kerneydelserne – bortset fra grunde og bygninger, der konteres under område 7. \n\nOmråderne 6060 – 6065 er struktureret ens, idet der her primært er taget afsæt i de centrale informationsbehov. Heri indgår bl.a. at anskaffelser over 100.000 kr. skal indarbejdes i Aabenraa Kommunes regnskab som anlægsaktiver, hvorfor det er relevant at disse forholdsvist nemt kan udsøges. Forrentning og afskrivning er dimensionsværdier, der alene anvendes centralt ifm. udarbejdelse af omkostningsregnskabet. \n",null,42,"42: Lønrefusioner","Område 4042 omfatter refusioner vedr. personale",null,310,"310: Pulje mv. - Reduktion/omstilling","Her må ikke bogføres. Anvendes kun til registrering af budgetpuljer til senere udmøntning.",null,3030310,"3030310: Pulje mv. - Reduktion/omstilling","Her må ikke bogføres. Anvendes kun til registrering af budgetpuljer til senere udmøntning."]
[70,"70: Grunde og bygninger","Under område 70 Grunde og bygninger konteres alle udgifter der vedrører de ejendomme som Aabenraa Kommune anvender, uanset om det er egne bygninger/arealer eller de lejes hos eksterne udlejere. ",null,44,"44: Uddannelse","Område 4444 omfatter udgifter vedr. uddannelse af kommunens personale",null,320,"320: Pulje mv. - Politisk til prioritering","Her må ikke bogføres. Anvendes kun til registrering af budgetpuljer til senere politisk prioritering.",null,3030320,"3030320: Pulje mv. - Politisk til prioritering","Her må ikke bogføres. Anvendes kun til registrering af budgetpuljer til senere politisk prioritering."]
[80,"80: Betaling andre offentlige myndigheder","Under område 8080 Betaling andre offentlige myndigheder konteres alle udgifter, der f.eks. vedrører mellemkommunale betalinger.",null,46,"46: Øvrige personaleudgifter","Omrde 4446 omfatter udgifterne  til  personalerelaterede udgifter - bortset fra løn og uddannelse",null,320,"320: Pulje mv. - Flexjob","Her må ikke bogføres. Anvendes kun til registrering af budgetpuljer til senere politisk prioritering.",null,3032320,"3032320: Pulje mv. - Flexjob","Her må ikke bogføres. Anvendes kun til registrering af budgetpuljer til senere politisk prioritering."]
{"$rows_left_out":141}